id,wght,qd1,qd5b,qd7,qd10,capofam,status,edu,ncomp_18,comp_f_1,comp_f_2,comp_f_3,comp_f_4,comp_f_5,comp_f_6,comp_f_7,comp_f_8,comp_f_99,reddito,casa,pop_com,area5,qf1,qf1_a,qf2_1,qf2_2,qf2_3,qf2_4,qf2_5,qf2_6,qf2_99,qf3_1,qf3_2,qf3_3,qf3_5,qf3_6,qf3_7,qf3_98,qf3_99,qf3_8,qf4,qf8,qf9_1,qf9_2,qf9_3,qf9_4,qf9_5,qf9_6,qf9_7,qf9_8,qf9_9,qf9_10,qf9_11,qf9_97,qf9_99,qf9_12,qf11,qf12_1_1,qf12_1_2,qf12_2_1,qf12_2_2,qf12_3_1,qf12_3_2,qf12_3_3,qf12_3_6,qf12_4_1,qf12_4_2,qf12_5_1,qf12_5_3,qf12_6_1,qf12_6_2,qf12_7_1,qf12_97,qf12_99,qf13,qprod1b_1,qprod1b_2,qprod1b_3,qprod1b_5,qprod1b_6,qprod1b_7,qprod1b_8,qprod1b_10,qprod1b_11,qprod1b_12,qprod1b_13,qprod1b_14,qprod1b_15,qprod1b_5_1,qprod1b_17,qprod1b_97,qprod1b_98,qprod1b_99,qprod1c_1,qprod1c_2,qprod1c_3,qprod1c_5,qprod1c_6,qprod1c_7,qprod1c_8,qprod1c_10,qprod1c_11,qprod1c_12,qprod1c_13,qprod1c_14,qprod1c_15,qprod1c_5_1,qprod1c_17,qprod1c_97,qprod1c_98,qprod1c_99,qprod1_d,qprod2,qprod3_int_1,qprod3_int_2,qprod3_int_3,qprod3_int_4,qprod3_int_5,qprod3_int_99,qprod3_int_6,qprod4_1,qprod4_2,qprod4_3,qprod4_4,qprod4_5,qprod4_7,qprod4_8,qprod4_9,qs1_1,qs1_2,qs1_3,qs1_4,qs1_5,qs1_7,qs1_8,qs1_9,qs1_10,qs1_11,qs1_13,qs2_1,qs2_2,qs2_3,qs2_4,qs2_5,qs3_1,qs3_2,qs3_3,qs3_4,qs3_5,qs3_6,qs3_7,qs3_8,qs3_9,qs3_10,qs3_11,qs3_12,qk1,qk3,qk4,qk5,qk6,qk7_1,qk7_1alt,qk7_2,qk7_3,qk7_3alt,qk8,qk9,qk10,FK1,FK2,FK3,FK4,FK5,FK6,FK7,FK,FA2,FA3,FA1,FA,FB1,FB2,FB5,FB6,FB3,FB4,FB7,FB8,FB,FL,anno
1001441,25630.7156256087,0,3,41,1,2,2,3,2,0,0,1,0,0,0,0,0,0,14,3,4,2,2,,0,0,1,1,0,1,0,0,0,0,0,0,0,0,1,0,-97,5,0,0,0,0,0,0,0,0,0,1,0,0,0,0,0,,,,,,,,,,,,,,,,,,5,0,0,0,0,1,1,1,0,0,0,0,0,0,0,0,0,0,0,0,0,0,0,0,0,0,0,0,0,0,0,0,0,0,0,0,1,,,,,,,,,,0,0,0,0,0,0,0,0,3,5,2,2,2,-99,3,-97,5,1,5,2,3,1,1,1,5,3,-99,1,3,3,3,-99,1,4,5,5,4,3,0,102,2,1,,1,-97,,-97,-97,0,1,1,1,0,1,1,0,5,3,2,5,3.3333333,1,0,1,0,1,1,0,1,5,13.333333,2020
1001442,14266.9612104918,1,3,57,2,1,2,4,3,0,1,0,1,0,0,0,0,0,14,3,4,2,2,,0,0,1,0,0,1,0,0,0,0,0,0,0,1,0,0,-99,5,1,0,0,0,0,0,0,0,0,0,0,0,0,0,1,0,0,0,0,0,0,0,0,0,0,0,0,0,1,0,0,0,4,0,0,0,0,0,1,0,0,0,0,0,0,0,0,0,0,0,0,0,0,0,0,0,0,0,0,0,0,0,0,0,0,0,0,1,0,,,,,,,,,,0,0,0,0,0,0,0,0,5,5,4,5,2,2,2,5,5,1,5,2,2,1,5,1,3,-97,1,2,3,2,4,4,2,1,5,3,5,2,0,102,2,1,,1,-97,,-97,-97,-97,0,1,1,0,1,1,0,4,5,4,5,4.6666665,1,0,1,1,1,1,0,0,5,13.666666,2020
1001443,33799.2429835295,0,2,30,2,2,6,3,2,0,1,0,0,0,0,0,0,0,13,3,4,2,2,,0,0,1,1,0,1,0,0,0,0,0,0,0,1,0,0,-97,5,0,0,0,0,0,0,0,0,0,0,0,1,0,0,1,0,0,1,0,0,0,0,0,0,0,0,0,0,0,0,0,0,3,0,0,0,0,0,1,0,0,0,0,0,1,0,0,0,0,0,0,0,0,0,0,0,0,0,0,0,0,0,0,0,0,0,0,1,0,,,,,,,,,,0,0,0,0,0,0,0,0,3,5,3,5,1,1,3,5,3,1,5,1,2,1,4,1,4,3,2,1,3,5,4,2,1,1,4,3,5,3,0,102,1,1,,1,-97,,-95,4,1,1,1,1,1,1,1,0,6,3,3,4,3.3333333,1,0,1,0,1,1,0,1,5,14.333333,2020
1001444,10941.307712482,0,2,56,2,2,6,3,2,0,1,0,0,0,0,0,0,0,13,3,4,2,2,,0,0,1,0,0,1,0,0,0,0,0,0,0,1,0,0,1,5,0,0,0,0,0,0,0,0,0,0,0,1,0,0,1,0,0,0,0,0,0,0,0,0,0,0,0,0,1,0,0,0,3,0,0,0,0,1,1,0,0,0,0,0,0,0,0,0,0,0,0,0,0,0,0,0,0,0,0,0,0,0,0,0,0,0,0,1,0,,,,,,,,,,0,0,0,0,0,0,0,0,3,5,2,5,2,2,4,5,4,1,5,3,2,1,4,2,5,2,1,1,1,2,4,2,1,2,4,4,5,3,0,102,2,1,,1,1,,-95,4,-97,1,1,1,0,1,1,1,6,3,2,4,3,1,0,1,0,1,1,0,0,4,13,2020
1001445,10941.307712482,0,3,58,2,2,2,3,3,0,1,0,1,0,0,0,0,0,14,1,4,2,2,,0,0,1,1,0,0,0,0,0,0,0,0,0,0,1,0,-99,4,0,0,0,0,0,0,0,0,0,1,0,0,0,0,0,,,,,,,,,,,,,,,,,,-97,0,0,0,0,0,1,0,1,0,0,0,0,0,0,0,0,0,0,0,0,0,0,0,0,0,0,0,0,0,0,0,0,0,0,0,1,,,,,,,,,,0,0,0,0,0,0,0,0,3,5,3,3,2,2,-97,5,5,1,5,2,2,1,3,1,3,-97,2,1,1,4,4,5,1,2,5,3,5,3,0,102,2,0,,0,0,,-95,4,-97,1,1,1,0,0,0,0,3,3,3,5,3.6666667,1,0,1,0,1,1,0,1,5,11.666667,2020
1001446,14266.9612104918,1,4,60,1,1,2,4,4,0,1,0,1,0,0,0,0,0,15,1,4,2,2,,1,0,0,1,0,1,0,0,0,0,0,0,0,0,1,0,-99,-99,0,0,0,0,0,0,0,0,0,1,0,0,0,0,0,,,,,,,,,,,,,,,,,,-99,0,0,0,0,1,1,1,0,0,1,0,0,0,0,0,0,0,0,0,0,0,0,0,0,0,0,0,0,0,0,0,0,0,0,1,0,,,,,,,,,,0,0,0,0,0,0,0,0,3,5,3,3,2,4,4,5,-99,1,5,1,-99,1,-99,1,5,-99,3,1,-97,3,3,5,2,3,5,5,4,3,0,102,2,,1,1,,1,-95,4,1,1,1,1,0,1,1,1,6,3,3,5,3.6666667,1,0,1,0,1,1,0,1,5,14.666667,2020
1001447,33799.2429835295,0,4,33,2,2,2,3,2,0,1,1,0,0,0,0,0,0,13,3,4,2,2,,0,0,1,0,0,1,0,0,0,0,0,0,0,1,0,0,-97,5,0,0,0,0,0,0,0,0,0,0,0,1,0,0,1,0,0,0,0,0,0,0,0,0,0,0,0,1,0,0,0,0,-97,0,0,0,0,0,1,0,0,0,0,0,1,0,0,0,0,0,0,0,0,0,0,0,0,0,0,0,0,0,1,0,0,0,0,0,0,,3,0,0,0,1,0,0,0,0,0,0,0,0,0,0,0,3,5,4,3,2,3,4,5,4,1,5,3,3,1,5,1,4,4,3,1,-97,2,3,3,2,3,4,4,5,3,0,102,2,,1,1,,-97,3,2,-97,1,1,1,0,1,1,0,5,3,4,4,3.6666667,1,0,1,0,1,1,1,0,5,13.666667,2020
1001448,27340.5921225631,0,5,86,6,3,3,5,5,0,0,0,1,0,1,0,0,0,15,1,4,2,3,1,0,0,0,0,0,0,1,0,1,0,0,0,0,0,0,0,-99,-99,0,0,0,0,0,0,0,0,0,0,0,0,1,0,0,,,,,,,,,,,,,,,,,,-97,0,0,0,0,0,1,1,0,0,0,0,0,0,0,0,0,0,0,0,0,0,0,0,0,0,0,0,0,0,0,0,0,0,0,1,0,,,,,,,,,,0,0,0,0,0,0,0,0,2,5,3,2,4,4,5,3,5,1,5,4,5,2,2,-99,2,2,4,1,-99,4,2,5,-99,3,2,5,5,2,-97,-97,-97,,1,1,,1,-95,4,-97,0,0,0,0,1,1,1,3,2,3,2,2.3333333,0,1,0,0,1,0,0,1,3,8.333333,2020
1001450,18084.9779489023,1,2,48,2,1,6,3,2,0,1,0,0,0,0,0,0,0,14,2,4,2,2,,0,0,1,0,0,1,0,0,0,0,0,0,0,0,1,0,1,4,0,0,0,0,0,0,0,0,0,0,0,1,0,0,0,,,,,,,,,,,,,,,,,,4,0,0,0,0,1,1,1,0,0,0,0,0,0,0,0,0,0,0,0,0,0,0,0,0,0,0,0,0,0,0,0,0,0,0,1,0,,,,,,,,,,0,0,0,0,0,0,0,0,3,5,3,3,1,3,1,5,4,1,4,1,3,1,1,1,5,2,3,1,2,3,3,5,3,3,5,3,3,3,0,102,1,,-97,1,,1,1,3,1,1,1,1,1,0,1,1,6,3,3,5,3.6666667,1,0,1,1,1,1,0,1,6,15.666667,2020
1001451,22845.1370234798,1,4,29,2,3,1,3,4,0,0,0,0,1,1,0,0,0,14,1,4,2,3,1,1,0,0,0,0,0,0,0,0,0,0,0,0,1,0,0,-97,-97,0,0,0,0,0,0,0,0,0,0,0,1,0,0,0,,,,,,,,,,,,,,,,,,-99,0,0,0,0,0,0,0,0,0,0,0,0,0,0,0,0,0,1,0,0,0,0,0,0,0,0,0,0,0,0,0,0,0,0,0,1,,,,,,,,,,0,0,0,0,0,0,0,0,2,5,3,3,4,-99,3,4,5,1,5,5,-99,2,-99,1,2,3,-99,2,3,1,5,5,-99,1,2,5,5,2,0,102,2,1,,1,-97,,-95,4,-97,0,1,1,0,1,1,0,4,2,3,2,2.3333333,0,0,0,0,1,1,0,1,3,9.333333,2020
1001452,20066.9264475865,0,4,49,2,2,6,3,2,0,1,1,0,0,0,0,0,0,13,3,4,2,3,1,1,0,0,0,0,0,0,0,0,0,0,0,0,1,0,0,-99,5,0,0,0,0,0,0,0,0,0,0,0,1,0,0,1,0,0,0,0,1,0,0,0,0,0,0,0,0,0,0,0,0,-97,0,0,0,0,0,1,0,0,0,0,0,0,0,0,0,0,0,0,0,0,0,0,0,0,0,0,0,0,0,0,0,0,0,0,1,0,,,,,,,,,,0,0,0,0,0,0,0,0,3,5,4,4,3,2,4,4,-99,1,5,2,3,1,5,1,4,-97,2,2,2,1,3,4,3,1,5,5,5,2,0,101,2,1,,1,-97,,-95,4,1,0,1,0,0,1,1,0,3,3,4,5,4,0,0,0,0,1,1,0,0,2,9,2020
1001456,17509.5135171967,0,3,54,4,2,2,5,3,0,1,0,1,0,0,0,0,0,14,1,3,1,2,,1,0,1,1,0,1,0,0,1,0,0,0,0,0,0,0,-98,3,0,0,0,0,0,0,1,0,0,0,0,0,0,0,0,,,,,,,,,,,,,,,,,,4,0,0,0,0,0,1,0,0,0,0,0,0,0,0,0,0,0,0,0,0,0,0,0,0,0,0,0,0,0,0,0,0,0,0,1,0,,,,,,,,,,0,0,0,0,0,0,0,0,3,5,3,3,2,5,3,4,5,1,5,2,2,1,3,1,3,3,3,2,3,3,2,3,3,3,3,5,4,-97,0,102,1,,1,1,,1,1,1,1,0,1,1,1,1,1,1,6,3,3,3,3,1,1,1,0,1,1,0,1,6,15,2020
1001457,17509.5135171967,0,4,51,2,2,2,3,2,0,1,1,0,0,0,0,0,0,15,2,3,1,2,,1,0,1,1,1,1,0,0,1,0,0,0,0,0,0,0,1,4,1,0,0,0,0,0,0,0,0,0,0,0,0,0,0,,,,,,,,,,,,,,,,,,4,0,0,1,0,1,1,0,0,0,0,0,0,0,0,0,0,0,0,0,0,0,0,0,0,0,0,0,0,0,0,0,0,0,0,1,0,,,,,,,,,,0,0,0,0,0,0,0,0,3,4,3,3,2,3,3,3,5,1,5,1,3,1,2,1,3,4,3,2,3,3,3,4,3,4,3,5,3,3,0,120,1,,1,1,,1,1,2,1,1,1,0,0,1,1,1,5,3,3,3,3,1,1,1,0,1,1,0,1,6,14,2020
1001472,14686.20025585,1,2,78,6,1,2,7,2,0,1,0,0,0,0,0,0,0,13,1,3,1,-99,-99,0,0,0,0,0,0,1,0,0,0,0,0,0,0,1,0,-99,-99,0,0,0,0,0,0,0,0,0,0,0,1,0,0,0,,,,,,,,,,,,,,,,,,-97,0,0,0,0,0,1,0,0,0,0,0,0,0,0,0,0,0,0,0,0,0,0,0,1,0,0,0,0,0,0,0,0,0,0,0,0,,-97,0,0,0,0,0,1,0,-97,-97,1,1,-99,1,-99,-97,1,1,2,2,2,2,2,2,1,2,2,2,2,1,2,2,2,2,2,2,2,2,2,2,2,2,2,2,2,-97,0,0,-97,,-97,-97,,-97,-99,-99,0,0,1,0,0,0,0,0,1,1,2,2,1.6666666,0,0,1,1,1,1,0,1,5,7.6666665,2020
1001473,19076.0728761624,0,4,37,2,2,2,5,2,0,1,1,0,0,0,0,0,0,13,3,3,1,2,,0,1,1,0,1,0,0,0,0,1,1,0,1,0,0,0,0,3,0,0,1,0,0,0,0,0,1,0,1,0,0,0,0,,,,,,,,,,,,,,,,,,-99,0,0,0,0,0,0,0,0,0,0,0,0,0,0,0,1,0,0,0,0,0,0,0,0,0,0,0,0,0,0,0,0,0,0,1,0,,,,,,,,,,1,0,1,1,-97,1,0,1,4,5,4,4,4,4,4,4,4,4,4,4,3,3,4,3,4,3,4,4,4,4,4,3,4,4,3,4,4,2,0,0,-99,,-99,-99,,-99,-99,-99,-99,0,1,0,0,0,0,0,1,4,4,3,3.6666667,1,1,0,0,0,0,0,1,3,7.666667,2020
1001474,22370.8556236801,0,2,79,6,2,2,4,2,0,1,0,0,0,0,0,0,0,11,3,3,1,-99,-99,0,0,0,0,0,0,1,0,0,0,0,0,0,0,1,0,-99,-99,0,0,0,0,0,0,0,0,0,0,0,0,1,0,-99,,,,,,,,,,,,,,,,,,-99,0,0,0,0,0,0,0,0,0,0,0,0,0,0,0,0,0,1,0,0,0,0,0,0,0,0,0,0,0,0,0,0,0,0,0,1,,,,,,,,,,0,-99,0,0,0,0,0,0,4,4,4,4,3,4,4,4,4,3,4,3,3,3,3,3,3,-97,3,3,3,3,3,3,-97,3,3,3,-99,-99,0,0,-97,,-97,-97,,0,-99,-99,0,0,1,0,0,0,0,0,1,4,4,3,3.6666667,0,0,0,0,0,0,0,1,1,5.666667,2020
1001476,14686.20025585,1,2,71,6,1,2,3,2,0,1,0,0,0,0,0,0,0,12,3,3,1,-97,-97,0,0,1,0,0,0,0,0,0,0,0,0,0,0,1,0,-99,-99,0,0,0,0,0,0,0,0,0,0,0,0,1,0,-99,,,,,,,,,,,,,,,,,,-99,0,0,0,0,0,0,0,0,0,0,0,0,0,0,0,0,0,1,0,0,0,0,0,0,0,0,0,0,0,0,0,0,0,0,0,1,,,,,,,,,,-99,-99,-99,-99,-99,-99,-99,-99,3,3,4,3,4,-97,4,3,4,3,4,4,3,4,3,3,3,4,3,4,3,4,4,4,4,4,3,5,4,2,0,0,-99,-99,,-99,1,,-99,-99,0,0,1,0,0,0,0,1,2,3,4,3,3.3333333,0,0,0,0,0,0,0,1,1,6.333333,2020
1001477,16465.4274062145,0,2,59,2,1,4,5,2,0,0,0,1,0,0,0,0,0,9,3,3,1,-99,-99,0,1,0,1,0,0,0,0,0,0,0,0,0,0,1,0,0,3,0,1,0,0,1,0,0,0,0,0,0,0,0,0,-99,,,,,,,,,,,,,,,,,,-97,0,0,0,0,0,0,0,0,0,0,0,0,0,0,0,0,1,0,0,0,0,0,0,0,0,0,0,0,0,0,0,0,0,0,1,0,,,,,,,,,,-99,-99,-99,-95,-99,-95,-99,-99,-97,3,-99,-99,-97,-97,2,3,-97,3,2,3,2,2,3,3,2,2,2,2,2,2,3,3,3,3,3,3,2,-97,0,0,-97,,1,1,,1,-99,-99,-99,0,1,0,0,1,1,1,4,3,3,3,3,0,0,0,1,1,0,0,1,3,10,2020
1001478,15896.1113546913,1,2,59,2,1,1,3,2,0,1,0,0,0,0,0,0,0,13,1,3,1,2,,1,1,0,0,0,0,0,0,0,0,0,0,0,1,0,0,1,2,0,0,0,0,0,0,0,0,0,0,0,1,0,0,1,1,0,0,0,0,0,0,0,0,0,0,0,0,0,0,0,0,-97,0,0,0,0,0,0,0,0,0,0,0,0,0,0,0,1,0,0,0,0,0,0,0,0,0,0,0,0,0,0,0,0,0,1,0,0,,,,,,,,,,1,0,1,1,1,0,0,1,1,2,2,2,2,2,1,2,1,2,2,2,2,3,2,3,2,1,2,2,2,2,1,1,1,2,2,2,2,2,0,0,-97,,-97,0,,0,-97,-97,0,0,1,0,0,0,0,0,1,1,2,2,1.6666666,1,0,1,1,0,0,0,1,4,6.6666665,2020
1001479,15896.1113546913,1,2,60,6,1,2,3,2,0,1,0,0,0,0,0,0,0,11,1,3,1,2,,0,1,0,0,0,0,0,0,0,0,0,0,0,0,1,0,0,3,0,0,0,0,0,0,0,0,0,0,0,0,1,0,-99,,,,,,,,,,,,,,,,,,-99,0,0,0,0,0,0,0,0,0,0,0,0,0,0,0,0,0,1,0,0,0,0,0,0,0,0,0,0,0,0,0,0,0,0,0,1,,,,,,,,,,-95,1,-97,1,1,-97,0,-97,2,2,2,2,2,1,2,2,2,2,2,1,1,2,2,3,2,2,2,2,2,2,1,2,2,3,2,2,3,2,0,0,-97,,-97,1,,1,-99,-99,0,0,1,0,0,0,1,1,3,2,2,2,2,0,0,1,1,1,0,0,1,4,9,2020
1001481,42280.938578518,1,4,36,2,1,2,3,2,0,1,1,0,0,0,0,0,0,13,2,3,1,2,,0,0,0,0,1,0,0,0,1,0,0,0,0,0,0,0,0,3,0,0,0,0,0,0,0,0,0,0,0,0,1,0,0,,,,,,,,,,,,,,,,,,-99,0,0,0,0,0,0,0,0,0,0,0,0,0,0,0,0,1,0,0,0,0,0,0,0,0,0,0,0,0,0,0,0,0,0,1,0,,,,,,,,,,1,1,0,1,1,1,-97,1,3,3,3,2,2,3,3,1,3,3,2,2,2,2,2,2,3,2,2,2,3,3,2,2,3,2,3,3,3,2,0,0,-99,,0,1,,1,-99,-99,0,0,1,0,0,0,1,1,3,3,3,3,3,0,1,1,0,1,1,0,1,5,11,2020
1001486,15495.995647792,0,1,77,6,1,6,3,1,1,0,0,0,0,0,0,0,0,7,1,5,5,1,,0,0,0,0,0,0,1,0,0,0,0,0,0,1,0,0,0,6,1,0,0,0,0,0,0,0,0,0,0,0,0,0,0,,,,,,,,,,,,,,,,,,4,0,0,0,0,0,0,0,0,0,0,0,0,0,0,0,0,1,0,0,0,0,0,0,0,0,0,0,0,0,0,0,0,0,0,1,0,,,,,,,,,,0,0,0,0,0,0,0,0,5,5,5,1,2,5,5,-97,5,1,-97,1,1,1,1,1,5,-97,4,1,2,5,-97,4,3,1,1,2,3,2,0,102,2,1,,1,-97,,1,3,1,0,1,1,0,1,1,0,4,5,5,1,3.6666667,0,0,1,0,1,1,0,1,4,11.666667,2020
1001488,8622.875766777181,0,3,53,4,2,2,5,3,0,0,0,1,0,0,0,0,0,9,1,5,5,3,0,0,1,0,0,0,0,0,0,0,0,0,0,0,1,0,0,-98,6,0,0,0,0,0,0,0,0,0,0,0,1,0,0,-99,,,,,,,,,,,,,,,,,,-97,0,0,0,0,0,0,0,0,0,0,0,0,0,0,0,0,1,0,0,0,0,0,0,0,0,0,0,0,0,0,0,0,0,0,1,0,,,,,,,,,,-95,-95,-95,-95,-95,-95,-95,-95,1,5,1,1,-99,-99,5,1,5,2,-99,1,1,1,3,1,2,4,3,2,1,5,3,5,4,1,1,5,-99,-97,0,102,2,,1,1,,0,2,3,-97,0,1,1,0,1,1,0,4,1,1,1,1,0,0,0,0,1,1,0,1,3,8,2020
1001491,15495.995647792,0,2,72,4,2,2,7,2,0,1,0,0,0,0,0,0,0,7,1,5,5,3,0,0,0,0,0,0,0,1,0,0,0,0,0,0,0,1,0,-99,-97,0,0,0,0,0,0,0,0,0,0,0,1,0,0,0,,,,,,,,,,,,,,,,,,3,0,0,0,0,0,0,0,0,0,0,0,0,0,0,0,0,1,0,0,0,0,0,0,0,0,0,0,0,0,0,0,0,0,0,1,0,,,,,,,,,,0,0,0,0,0,0,0,0,4,5,4,1,5,1,5,1,5,1,5,1,2,2,3,1,2,5,3,3,5,5,-97,1,5,1,2,5,5,-97,0,110,1,-97,,-97,-97,,3,2,1,0,1,0,0,0,0,0,1,4,4,2,3.3333333,0,0,0,0,1,1,0,1,3,7.333333,2020
1001492,8917.128327610581,1,2,70,6,1,2,3,2,0,1,0,0,0,0,0,0,0,8,1,5,5,1,,0,0,1,1,0,0,0,0,0,0,0,0,0,0,1,0,1,4,0,0,0,0,0,0,0,0,0,0,0,0,1,0,0,,,,,,,,,,,,,,,,,,4,0,0,0,0,0,0,0,0,0,0,0,0,0,0,0,0,1,0,0,0,0,0,0,0,0,0,0,0,0,0,0,0,0,0,1,0,,,,,,,,,,0,0,0,0,0,0,0,0,3,3,4,2,2,2,2,4,2,4,4,2,4,5,4,3,5,5,2,5,2,5,5,3,4,5,3,5,3,-97,0,102,1,,0,0,,1,2,1,1,0,1,1,1,0,0,1,4,3,4,3,3.3333333,1,0,1,1,0,0,0,1,4,11.333333,2020
1001493,8917.128327610581,1,2,70,6,1,2,3,2,0,1,0,0,0,0,0,0,0,8,1,5,5,2,,0,1,0,1,0,1,0,0,0,0,0,0,0,1,0,0,1,6,1,0,0,0,0,0,0,0,0,0,0,0,0,0,0,,,,,,,,,,,,,,,,,,4,0,0,0,0,0,0,0,0,0,0,0,0,0,0,0,0,1,0,0,0,0,0,0,0,0,0,0,0,0,0,0,0,0,0,1,0,,,,,,,,,,0,0,0,0,0,0,0,0,5,5,5,2,1,4,5,2,5,1,-97,2,5,1,2,1,4,-97,5,1,-97,1,-97,5,4,3,3,5,4,3,0,2,1,1,,-97,-97,,2,1,1,1,1,0,0,1,0,0,3,5,5,3,4.3333335,1,0,1,0,1,1,0,1,5,12.333334,2020
1001496,8917.128327610581,1,1,77,6,1,3,3,1,1,0,0,0,0,0,0,0,0,8,1,5,5,1,,1,1,0,1,0,0,0,0,1,0,0,0,0,0,0,0,1,1,1,0,0,0,0,0,0,0,0,0,0,0,0,0,0,,,,,,,,,,,,,,,,,,5,0,0,0,0,0,1,1,0,0,0,0,0,0,0,0,0,0,0,0,0,0,0,0,0,0,0,0,0,0,0,0,0,0,0,1,0,,,,,,,,,,0,0,0,0,0,0,0,0,4,4,4,1,1,5,4,1,5,1,-97,1,2,1,1,1,5,1,5,1,-97,4,-97,4,2,2,3,5,-97,2,0,102,1,,1,1,,1,2,1,1,0,1,1,1,1,1,1,6,4,4,3,3.6666667,1,1,1,0,1,1,0,1,6,15.666667,2020
1001497,10383.6690720689,0,2,60,2,1,1,3,2,0,0,0,0,1,0,0,0,0,9,1,5,5,1,,1,1,0,0,0,0,0,0,1,0,0,0,0,0,0,0,1,4,1,0,0,0,0,0,0,0,0,0,0,0,0,0,0,,,,,,,,,,,,,,,,,,4,0,0,0,0,0,1,1,0,0,0,0,0,0,0,0,0,0,0,0,0,0,0,0,0,0,0,0,0,0,0,0,0,0,0,1,0,,,,,,,,,,0,0,0,0,0,0,0,0,5,5,4,1,1,3,3,1,5,1,-97,1,3,1,1,1,5,5,5,1,1,5,2,5,2,3,5,5,4,2,0,102,1,1,,1,1,,2,1,1,0,1,1,1,1,1,1,6,5,4,5,4.6666665,1,1,1,0,1,1,0,1,6,16.666666,2020
1001498,9498.781478417421,1,2,45,2,1,2,3,2,0,1,0,0,0,0,0,0,0,13,1,5,5,-97,0,0,0,0,0,0,0,1,0,0,0,0,0,0,0,1,0,-99,-99,1,0,0,0,0,0,0,0,0,0,0,0,0,0,1,0,0,0,0,0,0,0,0,0,0,0,0,0,0,0,1,0,5,0,0,0,0,0,1,1,0,0,0,0,0,0,0,0,0,0,0,0,0,0,0,0,0,0,0,0,0,0,0,0,0,0,0,1,0,,,,,,,,,,0,0,0,0,0,0,0,0,3,4,3,2,1,2,3,4,2,3,5,5,2,5,2,1,2,2,4,4,3,4,2,2,3,5,2,3,2,3,0,102,1,,0,0,,0,2,2,-97,1,1,1,1,0,0,0,4,3,3,2,2.6666667,0,0,1,0,0,1,0,1,3,9.666667,2020
1001499,9498.781478417421,1,2,54,1,1,2,3,2,0,1,0,0,0,0,0,0,0,11,1,5,5,1,,1,1,0,1,0,0,0,1,1,0,0,0,0,0,0,0,0,1,1,0,0,0,0,0,0,0,0,0,0,0,0,0,0,,,,,,,,,,,,,,,,,,5,0,0,0,0,0,1,1,0,0,0,0,1,0,0,0,0,0,0,0,0,0,0,0,0,0,0,0,0,0,0,0,0,0,0,1,0,,,,,,,,,,0,0,0,0,0,0,0,0,4,3,4,2,3,3,3,3,3,1,2,2,2,1,2,1,3,2,3,2,2,3,4,3,4,3,3,2,4,2,0,100,1,,-97,-97,,0,1,3,1,0,1,0,0,0,0,0,1,4,4,3,3.6666667,1,1,0,0,1,1,0,1,5,9.666667,2020
1001501,16812.9763154517,0,4,42,4,2,2,3,2,0,1,1,0,0,0,0,0,0,12,1,2,4,2,,1,0,0,1,0,0,0,0,1,0,0,0,0,0,0,0,1,2,1,0,0,0,0,0,0,0,1,0,0,0,0,0,0,,,,,,,,,,,,,,,,,,5,0,0,0,0,0,1,1,0,0,0,0,0,0,0,0,0,0,0,0,0,0,0,0,0,0,0,0,0,0,0,0,0,0,0,1,0,,,,,,,,,,0,0,0,0,0,0,0,0,4,5,3,1,1,4,1,3,5,1,5,1,5,1,2,1,1,3,5,1,1,1,4,5,3,5,5,5,4,3,0,102,1,1,,1,1,,1,3,0,1,1,1,1,1,1,1,7,4,3,5,4,1,1,1,1,1,1,0,1,7,18,2020
1001502,12791.5838091832,0,4,45,4,2,2,5,4,0,1,0,1,0,0,0,0,0,10,1,2,4,3,0,0,0,0,0,0,1,0,0,0,0,0,0,0,1,0,0,0,4,0,0,0,0,0,0,0,0,0,0,0,1,0,0,1,1,0,0,0,0,0,0,0,0,0,0,0,0,0,0,0,0,-97,0,0,0,0,0,0,1,0,0,0,0,0,0,0,0,0,0,0,0,0,0,0,0,0,0,0,0,0,0,0,0,0,0,0,1,0,,,,,,,,,,0,0,0,0,0,0,0,0,4,5,5,5,2,4,4,1,2,1,5,1,1,1,5,2,1,5,2,1,5,1,3,1,1,2,1,5,5,2,0,102,2,1,,1,0,,1,3,-97,0,1,1,0,1,1,0,4,4,5,1,3.3333333,0,0,1,0,1,1,0,1,4,11.333333,2020
1001503,11704.6508019679,1,4,44,2,1,2,3,2,0,1,1,0,0,0,0,0,0,11,1,2,4,2,,1,0,1,0,0,0,0,0,1,0,0,0,0,0,0,0,0,4,1,0,0,0,0,0,0,0,0,0,0,0,0,0,1,0,0,0,0,0,0,0,0,0,0,0,0,0,1,0,0,0,4,0,0,0,0,0,0,1,0,0,0,0,0,0,0,0,0,0,0,0,0,0,0,0,0,1,0,0,0,0,0,0,0,0,0,0,0,,3,0,1,0,1,1,0,0,0,0,0,0,0,0,0,0,3,5,3,5,1,3,3,2,4,1,5,2,4,1,3,2,1,2,4,2,1,1,2,5,3,2,3,3,3,3,0,102,1,,1,1,,1,1,3,0,1,1,1,1,1,1,1,7,3,3,3,3,1,1,1,0,1,1,2,0,7,17,2020
1001505,14636.714754875,1,4,49,1,1,2,5,4,0,1,0,1,0,0,0,0,0,11,1,1,4,2,,1,0,0,1,0,0,0,0,0,0,0,0,0,1,0,0,-97,3,1,0,0,0,0,0,0,0,0,0,0,0,0,0,1,0,1,0,0,0,0,0,0,0,0,0,0,0,0,0,0,0,5,0,0,0,0,0,1,0,0,0,0,0,0,0,0,0,0,0,0,0,0,0,0,0,0,0,0,0,0,0,0,0,0,0,0,1,0,,,,,,,,,,0,0,0,0,0,0,0,0,2,5,3,3,1,3,1,4,4,1,5,1,3,1,2,2,1,5,3,1,4,1,3,5,3,3,2,5,4,3,0,102,1,,1,1,,1,1,3,1,1,1,1,1,1,1,1,7,2,3,2,2.3333333,1,0,1,1,1,1,0,1,6,15.333333,2020
1001506,13005.0507272862,0,4,56,1,2,2,3,4,0,1,0,1,0,0,0,0,0,11,1,1,4,3,1,0,1,1,0,0,0,0,0,0,0,0,0,0,1,0,0,-97,4,0,0,0,0,1,0,0,0,1,1,0,0,0,0,-97,,,,,,,,,,,,,,,,,,4,0,0,0,0,0,1,0,0,0,0,0,1,0,0,0,0,0,0,0,0,0,0,0,0,0,0,0,0,0,0,0,0,0,0,1,0,,,,,,,,,,0,0,0,0,0,0,0,0,3,5,2,2,3,3,2,3,3,4,5,1,2,1,2,1,3,2,2,3,3,2,3,2,3,3,2,2,3,3,0,102,1,,1,1,,1,1,3,0,1,1,1,1,1,1,1,7,3,2,2,2.3333333,1,0,0,1,1,1,0,1,5,14.333333,2020
1001507,26530.7006885712,0,4,33,4,2,2,3,2,0,1,1,0,0,0,0,0,0,9,3,1,4,2,,1,0,1,1,0,0,0,0,0,0,0,0,0,1,0,0,1,4,0,0,0,0,0,0,1,0,0,0,0,0,0,1,1,0,0,0,0,1,0,0,0,0,0,0,0,1,1,0,0,0,3,0,0,0,0,0,1,0,0,0,0,0,0,0,0,0,0,0,0,0,0,0,0,0,0,0,0,0,0,0,0,0,0,0,0,1,0,,,,,,,,,,0,0,0,0,0,0,0,0,5,5,5,5,1,2,3,3,4,1,5,1,1,1,4,3,1,5,2,1,4,1,4,5,2,2,2,5,3,3,0,102,1,,1,1,,1,1,3,1,1,1,1,1,1,1,1,7,5,5,2,4,1,0,1,0,1,0,0,0,3,14,2020
1001508,12791.5838091832,0,3,49,4,2,2,3,2,0,1,1,0,0,0,0,0,0,12,1,1,4,2,,0,1,0,1,0,0,0,0,1,0,0,0,0,0,0,0,1,2,0,0,0,0,0,0,0,0,0,0,0,0,0,1,0,,,,,,,,,,,,,,,,,,5,0,0,0,0,0,1,1,0,0,0,0,0,0,0,0,0,0,0,0,0,0,0,0,0,0,0,0,0,0,0,0,0,0,0,1,0,,,,,,,,,,0,0,0,0,0,0,0,0,4,5,3,3,1,3,2,4,4,1,5,1,3,1,2,1,1,3,3,2,1,1,3,5,2,3,5,4,2,3,0,102,1,,1,1,,1,1,3,0,1,1,1,1,1,1,1,7,4,3,5,4,1,1,1,1,1,1,0,1,7,18,2020
1001509,14636.714754875,1,4,45,2,1,2,3,2,0,1,1,0,0,0,0,0,0,12,1,1,4,1,,1,1,0,0,0,0,0,0,1,0,0,0,0,0,0,0,1,3,1,0,0,0,0,0,0,0,1,0,0,0,0,0,1,0,1,0,0,0,0,0,0,0,0,0,0,0,1,0,0,0,4,0,0,0,0,0,1,1,0,0,0,0,0,0,0,0,0,0,0,0,0,0,0,0,0,0,0,0,0,0,0,0,0,0,0,1,0,,,,,,,,,,0,0,0,0,0,0,0,0,3,5,3,4,1,2,2,4,3,1,5,1,3,1,2,1,1,5,3,1,4,2,3,5,3,3,5,3,3,3,0,102,1,1,,1,1,,1,3,1,1,1,1,1,1,1,1,7,3,3,5,3.6666667,1,1,1,1,1,1,0,0,6,16.666666,2020
1001510,21147.7052524573,0,2,71,6,2,2,7,2,0,1,0,0,0,0,0,0,0,11,1,1,4,3,0,0,1,0,0,0,0,0,0,1,0,0,0,0,0,0,0,1,4,1,0,0,0,0,0,0,0,0,0,0,0,0,1,0,,,,,,,,,,,,,,,,,,4,0,0,0,0,0,0,1,0,0,0,0,0,0,0,0,0,0,0,0,0,0,0,0,0,0,0,0,0,0,0,0,0,0,0,1,0,,,,,,,,,,0,0,0,0,0,0,0,0,5,5,5,2,1,5,5,5,5,1,5,1,5,1,5,1,4,3,3,1,3,4,2,3,4,4,2,3,5,-97,0,102,2,,0,0,,0,1,3,1,0,1,1,0,0,0,0,2,5,5,2,4,0,1,1,0,1,1,0,1,5,11,2020
1001511,17416.6350518833,1,4,20,9,3,1,2,4,0,0,0,0,1,1,0,0,0,8,1,1,4,3,0,0,1,0,0,0,0,0,0,0,0,0,0,0,1,0,0,0,4,0,0,0,0,0,0,0,0,0,0,0,1,0,0,1,1,0,0,0,0,0,0,0,0,0,0,0,0,0,0,0,0,-97,0,0,0,0,0,0,0,0,0,0,0,0,0,0,0,0,1,0,0,0,0,0,0,0,0,0,0,0,0,0,0,0,0,0,1,0,,,,,,,,,,0,0,0,0,0,0,0,0,5,5,3,1,1,3,1,5,4,1,5,1,2,1,2,1,1,2,3,1,2,1,2,5,1,3,4,3,2,3,0,102,1,0,,0,0,,1,3,1,1,1,1,1,0,0,0,4,5,3,4,4,0,0,1,1,1,1,0,1,5,13,2020
1001512,11704.6508019679,1,3,43,5,1,2,3,2,0,1,1,0,0,0,0,0,0,4,1,1,4,1,,0,1,0,1,0,0,0,0,1,0,0,0,0,0,0,0,1,5,1,0,0,0,0,0,0,0,0,0,0,0,0,0,1,0,0,0,0,1,0,0,0,0,0,0,0,0,0,0,0,0,3,0,0,0,0,0,1,0,0,0,0,0,0,0,0,0,0,0,0,0,0,0,0,0,0,0,0,0,0,0,0,0,0,0,0,1,0,,,,,,,,,,0,0,0,0,0,0,0,0,2,5,3,3,2,3,1,3,5,1,5,2,1,1,2,2,1,4,3,1,4,1,4,5,2,2,3,5,3,3,0,102,1,,1,1,,1,1,3,1,1,1,1,1,1,1,1,7,2,3,3,2.6666667,1,1,1,1,1,1,0,0,6,15.666667,2020
1001513,12791.5838091832,0,3,45,1,2,2,5,2,0,1,1,0,0,0,0,0,0,13,1,1,4,2,,1,1,1,0,0,0,0,0,0,0,0,0,0,1,0,0,1,5,1,0,0,0,0,0,0,0,0,1,0,0,0,0,0,,,,,,,,,,,,,,,,,,4,0,0,0,0,0,1,0,0,0,0,0,1,0,0,0,0,0,0,0,0,0,0,0,0,0,0,0,0,0,0,0,0,0,0,1,0,,,,,,,,,,0,0,0,0,0,0,0,0,2,5,2,3,1,3,2,4,5,1,5,2,3,3,2,2,1,3,3,2,4,1,2,5,3,2,3,2,3,3,0,102,1,,0,0,,0,1,3,1,1,1,1,1,0,0,0,4,2,2,3,2.3333333,1,0,1,1,0,1,0,1,5,11.333333,2020
1001515,14636.714754875,1,5,49,2,1,2,3,5,0,1,0,1,0,0,0,0,0,13,1,2,4,2,,0,1,1,0,0,0,0,0,1,0,0,0,0,0,0,0,1,3,1,0,0,0,0,0,0,0,0,1,0,0,0,0,0,,,,,,,,,,,,,,,,,,4,0,0,0,0,0,1,1,0,0,0,0,0,0,0,0,0,0,0,0,0,0,0,0,0,0,0,0,0,0,0,0,0,0,0,1,0,,,,,,,,,,0,0,0,0,0,0,0,0,4,5,2,3,1,3,3,4,4,1,5,2,4,1,2,1,1,5,3,1,1,1,2,5,2,3,5,2,3,3,0,102,1,,1,1,,1,1,3,0,1,1,1,1,1,1,1,7,4,2,5,3.6666667,1,1,1,0,1,1,0,1,6,16.666666,2020
1001516,12791.5838091832,0,4,46,2,2,2,3,3,0,1,1,1,0,0,0,0,0,11,1,2,4,2,,0,1,1,0,0,0,0,0,0,0,0,0,0,1,0,0,-97,5,1,0,0,0,0,0,0,0,0,0,0,0,0,0,1,1,1,0,0,0,0,0,0,0,0,0,0,0,0,0,0,0,3,0,0,0,0,0,1,0,0,0,0,0,0,0,0,0,0,0,0,0,0,0,0,0,0,0,0,0,0,0,0,0,0,0,0,1,0,,,,,,,,,,0,0,0,0,0,0,0,0,5,5,5,5,1,3,5,5,5,1,5,1,5,1,3,1,1,5,4,1,4,1,3,5,3,3,3,5,3,3,0,102,1,1,,1,1,,1,3,1,1,1,1,1,1,1,1,7,5,5,3,4.3333335,1,0,1,0,1,1,0,1,5,16.333334,2020
1001517,23686.8619195943,0,6,36,2,3,1,1,6,0,0,0,0,1,1,0,0,0,14,1,2,4,3,1,0,1,0,0,0,0,0,0,0,0,0,0,0,1,0,0,1,4,1,0,0,0,0,0,0,0,0,0,0,0,0,0,1,1,1,0,0,0,0,0,0,0,0,0,0,0,0,0,0,0,4,0,0,0,0,0,0,0,0,0,0,0,1,0,0,0,0,0,0,0,0,0,0,0,0,0,0,0,0,0,0,0,0,0,0,1,0,,,,,,,,,,0,0,0,0,0,0,0,0,3,5,3,3,1,4,3,5,4,1,5,1,4,1,1,1,1,4,5,3,5,2,5,5,2,2,4,3,3,3,0,102,1,1,,1,1,,1,3,0,1,1,1,1,1,1,1,7,3,3,4,3.3333333,0,0,1,0,1,1,0,1,4,14.333333,2020
1001519,14636.714754875,1,2,45,1,1,2,3,2,0,1,0,0,0,0,0,0,0,13,1,2,4,2,,1,1,0,0,0,1,0,0,1,0,0,0,0,0,0,0,1,2,1,0,0,0,0,0,0,0,1,1,0,0,0,0,0,,,,,,,,,,,,,,,,,,5,0,0,0,0,0,1,1,0,0,0,0,0,0,0,0,0,0,0,0,0,0,0,0,0,0,0,0,0,0,0,0,0,0,0,1,0,,,,,,,,,,0,0,0,0,0,0,0,0,3,5,3,1,1,5,1,5,5,1,5,1,5,1,1,1,1,5,5,1,5,1,2,5,3,5,5,5,2,3,0,102,1,,1,1,,1,1,3,1,1,1,1,1,1,1,1,7,3,3,5,3.6666667,1,1,1,1,1,1,0,1,7,17.666666,2020
1001520,19310.5860338832,1,4,32,2,3,1,3,4,0,0,0,0,1,1,0,0,0,13,1,2,4,3,1,0,1,0,0,0,0,0,0,0,0,0,0,0,1,0,0,1,4,0,0,0,0,0,0,0,0,0,0,0,1,0,0,1,1,1,0,0,0,0,0,0,0,0,0,0,0,0,0,0,0,3,0,0,0,0,0,1,0,0,0,0,0,0,0,0,0,0,0,0,0,0,0,0,0,1,0,0,0,0,0,0,0,0,0,0,0,0,,1,1,0,0,1,0,0,0,0,0,0,0,0,0,0,0,3,5,3,3,1,5,3,5,5,1,5,1,5,1,1,1,1,5,5,1,5,1,5,5,3,4,4,3,3,3,0,102,1,,1,1,,1,1,3,0,1,1,1,1,1,1,1,7,3,3,4,3.3333333,0,0,1,0,1,1,2,1,6,16.333334,2020
1001521,17416.6350518833,1,4,21,9,3,1,2,4,0,0,0,0,1,1,0,0,0,10,1,2,4,3,0,1,0,0,0,0,0,0,0,0,0,0,0,0,1,0,0,-97,-97,0,0,0,0,0,0,0,0,0,0,0,1,0,0,1,0,1,0,0,0,0,0,0,0,0,0,0,0,0,0,0,0,1,0,0,0,0,0,0,0,0,0,0,0,1,0,0,0,0,0,0,0,0,0,0,0,0,0,0,0,0,0,1,0,0,0,0,0,0,,1,0,0,0,1,0,0,0,0,0,0,0,0,0,0,0,5,5,3,3,1,4,4,5,5,1,5,1,4,1,4,2,1,2,5,1,2,3,2,5,3,5,2,5,2,3,0,102,1,,1,1,,1,1,3,0,1,1,1,1,1,1,1,7,5,3,2,3.3333333,0,0,1,0,1,1,1,1,5,15.333333,2020
1001526,45812.4062169422,1,2,77,6,1,6,5,2,0,1,0,0,0,0,0,0,0,12,1,3,1,1,,0,1,0,0,0,0,0,1,0,0,0,0,0,0,0,0,1,3,1,0,0,0,1,0,0,0,0,0,0,0,0,0,0,,,,,,,,,,,,,,,,,,-97,0,0,0,0,0,1,0,0,0,0,0,0,0,0,1,0,0,0,0,0,0,0,0,0,0,0,0,0,0,0,0,0,0,0,1,0,,,,,,,,,,0,0,0,0,0,0,0,0,5,2,5,1,1,1,5,4,2,4,5,2,3,3,4,1,-97,5,3,1,2,4,3,5,4,2,5,5,5,-97,0,120,3,,0,1,,1,-97,-97,-97,0,1,0,0,0,1,1,3,5,5,5,5,0,1,1,0,0,1,0,1,4,12,2020
1001527,45812.4062169422,1,2,74,6,1,2,4,2,0,1,0,0,0,0,0,0,0,12,1,3,1,2,,0,0,0,0,0,1,0,0,1,0,1,0,1,0,0,0,1,2,1,0,0,0,0,0,0,0,0,0,0,0,0,0,0,,,,,,,,,,,,,,,,,,5,0,0,0,0,1,1,1,1,1,1,0,0,0,0,0,0,0,0,0,0,0,0,0,0,0,0,0,1,0,0,0,0,0,0,0,0,,3,1,1,0,0,0,0,0,1,0,0,1,0,0,0,1,3,2,3,1,1,5,2,3,5,1,5,4,4,2,1,1,2,4,5,1,2,2,4,3,3,5,3,2,3,-97,0,102,2,1,,1,1,,1,3,-97,0,1,1,0,1,1,1,5,3,3,3,3,0,1,1,1,1,1,2,1,8,16,2020
1001528,83835.036394635,0,2,36,2,2,2,1,2,0,1,0,0,0,0,0,0,0,13,2,3,1,2,,1,1,1,0,0,1,0,1,1,0,0,0,0,0,0,0,1,3,1,0,0,0,0,0,0,0,0,0,0,0,0,0,0,,,,,,,,,,,,,,,,,,4,0,0,1,0,1,1,0,1,0,0,0,0,0,0,0,0,0,0,0,0,0,0,0,0,0,0,0,0,0,0,0,0,0,0,1,0,,,,,,,,,,0,0,0,0,0,0,0,0,5,4,4,3,2,2,2,2,5,1,-97,2,3,1,2,1,4,3,4,2,4,3,3,4,3,2,5,3,3,3,0,102,1,,1,-97,,-97,2,3,0,1,1,1,1,1,0,0,5,5,4,5,4.6666665,1,1,1,1,1,1,0,1,7,16.666666,2020
1001529,49586.625398135,1,2,59,6,3,1,5,2,0,0,0,0,1,0,0,0,0,12,1,3,1,3,1,0,0,1,1,0,0,0,0,0,0,0,0,0,1,0,0,-97,4,0,0,0,0,0,0,0,0,1,0,0,0,0,0,0,,,,,,,,,,,,,,,,,,-97,0,0,0,0,0,1,0,0,0,0,0,0,0,0,0,0,0,0,0,0,0,0,0,0,0,0,0,0,0,0,0,0,0,0,1,0,,,,,,,,,,0,0,0,0,0,0,0,0,3,5,3,3,2,2,5,3,5,1,5,2,3,1,2,1,1,5,2,1,5,1,2,4,3,3,1,3,4,1,0,102,1,1,,1,0,,3,2,0,0,1,1,1,1,1,0,5,3,3,1,2.3333333,1,0,1,0,1,1,0,1,5,12.333333,2020
1001530,45812.4062169422,1,3,68,6,1,2,5,3,0,1,0,1,0,0,0,0,0,10,1,3,1,1,,0,0,1,0,0,0,0,0,0,0,0,0,0,1,0,0,-97,5,1,0,0,0,0,0,0,0,0,0,0,0,0,0,0,,,,,,,,,,,,,,,,,,3,0,0,0,0,0,1,0,0,0,0,0,0,0,0,0,0,0,0,0,0,0,0,0,0,0,0,0,0,0,0,0,0,0,0,1,0,,,,,,,,,,0,0,0,0,0,0,0,0,4,5,2,2,2,3,4,-97,4,1,5,2,2,1,3,2,-99,3,2,1,3,2,-97,2,2,2,2,3,3,3,0,102,1,,1,1,,1,1,3,1,1,1,1,1,1,1,1,7,4,2,2,2.6666667,0,0,1,0,1,1,0,1,4,13.666667,2020
1001531,51362.5604784883,0,1,57,4,1,4,4,1,1,0,0,0,0,0,0,0,0,7,3,3,1,1,,0,0,1,0,0,0,0,1,0,0,0,0,0,0,0,0,0,4,0,0,0,0,0,0,0,0,1,0,0,0,0,0,1,0,1,0,0,0,0,0,0,0,0,1,0,0,0,0,0,0,5,0,0,0,0,1,1,0,0,0,0,0,0,0,0,0,0,0,0,0,0,0,0,0,0,0,0,0,0,0,0,0,0,0,0,1,0,,,,,,,,,,0,0,0,0,0,0,0,0,5,5,4,4,1,2,5,5,3,1,-97,3,2,1,4,2,3,5,3,2,-97,3,4,2,5,5,1,4,5,2,0,102,4,,0,1,,0,-95,4,-97,0,1,1,0,0,1,0,3,5,4,1,3.3333333,0,1,1,0,1,1,0,0,4,10.333333,2020